Festa patronale / Festa dei santi
type: Concept
alternative label: Feste patronali / Feste dei santi
has rank order: 3
preferred label: Patronal Feat / Saint Feast @en
in scheme: public-event-types
notation: 2.4.4
broader: https://w3id.org/italia/controlled-vocabulary/public-event-types/24
scope note: Nella versione deprecata 0.1 del vocabolario questo concetto corrisponde a https://w3id.org/italia/controlled-vocabulary/public-event-types/51_SaintFeast
broader transitive: https://w3id.org/italia/controlled-vocabulary/public-event-types/2
type: PublicEventTypology