Raduno di comunità
type: Concept
preferred label: Community gathering @en
definition: This concept includes public events such as folkloric and religious feasts, festivals, amateur competition, traditional gastronomic events, public celebration. @en
narrower: https://w3id.org/italia/controlled-vocabulary/public-event-types/242
narrower: https://w3id.org/italia/controlled-vocabulary/public-event-types/244
narrower: https://w3id.org/italia/controlled-vocabulary/public-event-types/241
alternative label: Raduni di comunità
narrower: https://w3id.org/italia/controlled-vocabulary/public-event-types/246
narrower: https://w3id.org/italia/controlled-vocabulary/public-event-types/245
in scheme: public-event-types
narrower: https://w3id.org/italia/controlled-vocabulary/public-event-types/243
definition: Questo concetto include eventi pubblici che richiamano un pubblico interessato a partecipare a 'momenti aggregativi comunitari' di vario genere, come feste di quartiere, festa patronale, raduni amatoriali, hobbistici, ma non religiose ecc.
has rank order: 2
notation: 2.4
broader: https://w3id.org/italia/controlled-vocabulary/public-event-types/2
type: PublicEventTypology