Giubileo
type: Concept
type: PublicEventTypology
has rank order: 3
preferred label: Jubilee @en
notation: 2.5.1
broader: https://w3id.org/italia/controlled-vocabulary/public-event-types/25
in scheme: public-event-types
scope note: Nella versione deprecata 0.1 del vocabolario questo concetto corrisponde a https://w3id.org/italia/controlled-vocabulary/public-event-types/54_Jubilee
alternative label: Giubilei
broader transitive: https://w3id.org/italia/controlled-vocabulary/public-event-types/2