Udienza giubilare
type: Concept
type: PublicEventTypology
preferred label: Jubilee hearing @en
alternative label: Udienze giubilari
scope note: Nella versione deprecata 0.1 del vocabolario questo concetto corrisponde a https://w3id.org/italia/controlled-vocabulary/public-event-types/53_JubileeAudience
in scheme: public-event-types
broader transitive: https://w3id.org/italia/controlled-vocabulary/public-event-types/2
broader: https://w3id.org/italia/controlled-vocabulary/public-event-types/25
has rank order: 3
notation: 2.5.2