Processione
type: PublicEventTypology
has rank order: 3
broader: https://w3id.org/italia/controlled-vocabulary/public-event-types/25
preferred label: Procession @en
scope note: Nella versione deprecata 0.1 del vocabolario questo concetto corrisponde a https://w3id.org/italia/controlled-vocabulary/public-event-types/56_Procession
alternative label: Processioni
broader transitive: https://w3id.org/italia/controlled-vocabulary/public-event-types/2
type: Concept
in scheme: public-event-types
notation: 2.5.3