Celebrazione Ecumenica
type: Concept
alternative label: Celebrazioni ecumeniche
preferred label: Ecumenical Celebration @en
notation: 2.5.4
broader: https://w3id.org/italia/controlled-vocabulary/public-event-types/25
broader transitive: https://w3id.org/italia/controlled-vocabulary/public-event-types/2
in scheme: public-event-types
scope note: Nella versione deprecata 0.1 del vocabolario questo concetto corrisponde a https://w3id.org/italia/controlled-vocabulary/public-event-types/52_EcumenicalCelebration
has rank order: 3
type: PublicEventTypology