Lettura Religiosa
type: PublicEventTypology
preferred label: Religious Reading @en
in scheme: public-event-types
alternative label: Readings @en
notation: 2.5.5
has rank order: 3
broader transitive: https://w3id.org/italia/controlled-vocabulary/public-event-types/2
alternative label: Letture religiose
broader: https://w3id.org/italia/controlled-vocabulary/public-event-types/25
scope note: Nella versione deprecata 0.1 del vocabolario questo concetto corrisponde a https://w3id.org/italia/controlled-vocabulary/public-event-types/57_ReligiousReading
type: Concept