Raduno religioso
type: PublicEventTypology
in scheme: public-event-types
has rank order: 3
broader: https://w3id.org/italia/controlled-vocabulary/public-event-types/25
notation: 2.5.6
alternative label: Raduni religiosi
broader transitive: https://w3id.org/italia/controlled-vocabulary/public-event-types/2
definition: Per esempio il raduno della gioventù cattolica
scope note: Nella versione deprecata 0.1 del vocabolario questo concetto corrisponde a https://w3id.org/italia/controlled-vocabulary/public-event-types/55_ReligiousDialogue
preferred label: Religious Gathering @en
type: Concept
definition: For instance the gathering of youth @en