Evento religioso
type: PublicEventTypology
narrower: https://w3id.org/italia/controlled-vocabulary/public-event-types/251
notation: 2.5
alternative label: Religious events @en
narrower: https://w3id.org/italia/controlled-vocabulary/public-event-types/254
narrower: https://w3id.org/italia/controlled-vocabulary/public-event-types/256
narrower: https://w3id.org/italia/controlled-vocabulary/public-event-types/253
narrower: https://w3id.org/italia/controlled-vocabulary/public-event-types/255
definition: This concept includes public events such as folkloric and religious feasts, festivals, amateur competition, traditional gastronomic events, public celebration. @en
scope note: Nella versione deprecata 0.1 del vocabolario questo concetto corrisponde a https://w3id.org/italia/controlled-vocabulary/public-event-types/5_ReligiousEvent
in scheme: public-event-types
type: Concept
definition: Questo concetto include eventi pubblici che richiamano un pubblico interessato a partecipare a 'momenti aggregativi comunitari' di vario genere, come feste di quartiere, festa patronale, raduni amatoriali, hobbistici, ma non religiose ecc.
has rank order: 2
narrower: https://w3id.org/italia/controlled-vocabulary/public-event-types/257
preferred label: Religious event @en
broader: https://w3id.org/italia/controlled-vocabulary/public-event-types/2
alternative label: Eventi religiosi
narrower: https://w3id.org/italia/controlled-vocabulary/public-event-types/252