Esposizione / Esposizione globale
type: PublicEventTypology
scope note: Nella versione deprecata 0.1 del vocabolario questo concetto corrisponde a https://w3id.org/italia/controlled-vocabulary/public-event-types/63_Expo
broader transitive: https://w3id.org/italia/controlled-vocabulary/public-event-types/4
notation: 4.1.2
in scheme: public-event-types
broader: https://w3id.org/italia/controlled-vocabulary/public-event-types/41
type: Concept
has rank order: 3
alternative label: Esposizioni / Esposizioni globali
preferred label: Expo global @en