Exhibition
type: Concept
definition: This concept includes public events such as expos, exhibitions and fairs.
alternative label: Fiere / Saloni @it
in scheme: public-event-types
preferred label: Fiera / Salone @it
narrower: https://w3id.org/italia/controlled-vocabulary/public-event-types/412
definition: Questo concetto include eventi pubblici quali expo, fiere, saloni orientati al business. @it
has rank order: 2
notation: 4.1
alternative label: Exhibitions
broader: https://w3id.org/italia/controlled-vocabulary/public-event-types/4
narrower: https://w3id.org/italia/controlled-vocabulary/public-event-types/411
type: PublicEventTypology