Riunione d'affari
type: Concept
type: PublicEventTypology
alternative label: Riunioni d'affari
broader: 42
broader transitive: 4
in scheme: public-event-types
notation: 4.2.1
preferred label: Business meeting @en
scope note: Nella versione deprecata 0.1 del vocabolario questo concetto corrisponde a https://w3id.org/italia/controlled-vocabulary/public-event-types/61_BusinessMeeting
has rank order: 3