Convention
type: Concept
in scheme: public-event-types
has rank order: 3
scope note: Nella versione deprecata 0.1 del vocabolario questo concetto corrisponde a https://w3id.org/italia/controlled-vocabulary/public-event-types/62_Convention
type: PublicEventTypology
broader transitive: https://w3id.org/italia/controlled-vocabulary/public-event-types/4
notation: 4.2.2
broader: https://w3id.org/italia/controlled-vocabulary/public-event-types/42