Round table
type: Concept
broader: https://w3id.org/italia/controlled-vocabulary/public-event-types/42
has rank order: 3
notation: 4.2.3
alternative label: Tavole rotonde @it
broader transitive: https://w3id.org/italia/controlled-vocabulary/public-event-types/4
preferred label: Tavola Rotonda @it
in scheme: public-event-types
alternative label: Round tables
alternative label: Panel discussion
scope note: Nella versione deprecata 0.1 del vocabolario questo concetto corrisponde a https://w3id.org/italia/controlled-vocabulary/public-event-types/65_PanelDiscussion @it
type: PublicEventTypology