Business meeting
type: Concept
narrower: https://w3id.org/italia/controlled-vocabulary/public-event-types/423
broader: https://w3id.org/italia/controlled-vocabulary/public-event-types/4
in scheme: public-event-types
narrower: https://w3id.org/italia/controlled-vocabulary/public-event-types/421
definition: This concept includes all those public events that are business meetings such as convention, round tables, etc.
alternative label: Riunioni d'affari @it
definition: Questo concetto include tutti quegli eventi pubblici riconducibili a riunioni d'affari come per esempio convention, tavole rotonde, ecc. @it
notation: 4.2
alternative label: Business meetings
preferred label: Riunione d'affari @it
has rank order: 2
type: PublicEventTypology
narrower: https://w3id.org/italia/controlled-vocabulary/public-event-types/422