Seasonal business event
type: PublicEventTypology
broader: https://w3id.org/italia/controlled-vocabulary/public-event-types/4
alternative label: Seasonal business events
type: Concept
in scheme: public-event-types
notation: 4.3
narrower: https://w3id.org/italia/controlled-vocabulary/public-event-types/431
definition: Questo concetto include quegli eventi commerciali di impatto pubblico che avvengono solo stagionalmente come i saldi @it
has rank order: 2
alternative label: Eventi stagionali commerciali @it
preferred label: Evento stagionale commerciale @it
definition: This concept includes all those commercial events that have a public impact and that happen seasonaly (e.g., sales)