Gara / Torneo / Competizione
type: Concept
broader: https://w3id.org/italia/controlled-vocabulary/public-event-types/51
alternative label: Gare / Tornei / Competizioni
preferred label: Sport competition @en
broader transitive: https://w3id.org/italia/controlled-vocabulary/public-event-types/5
notation: 5.1.2
type: PublicEventTypology
scope note: Nella versione deprecata 0.1 del vocabolario questo concetto corrisponde a https://w3id.org/italia/controlled-vocabulary/public-event-types/23_Competition
in scheme: public-event-types
has rank order: 3