Corse
type: Concept
type: PublicEventTypology
preferred label: Corsa
broader: https://w3id.org/italia/controlled-vocabulary/public-event-types/51
in scheme: public-event-types
broader transitive: https://w3id.org/italia/controlled-vocabulary/public-event-types/5
has rank order: 3
scope note: Nella versione deprecata 0.1 del vocabolario questo concetto corrisponde a https://w3id.org/italia/controlled-vocabulary/public-event-types/22_Race
preferred label: Race @en
notation: 5.1.5