Raduno sportivo
type: Concept
in scheme: public-event-types
broader transitive: https://w3id.org/italia/controlled-vocabulary/public-event-types/5
has rank order: 3
preferred label: Sport gathering @en
broader: https://w3id.org/italia/controlled-vocabulary/public-event-types/51
alternative label: Raduni sportivi
scope note: Nella versione deprecata 0.1 del vocabolario questo concetto corrisponde a https://w3id.org/italia/controlled-vocabulary/public-event-types/25_SportGathering
type: PublicEventTypology
notation: 5.1.6