Manifestazione sportiva
type: Concept
alternative label: Manifestazioni sportive
narrower: https://w3id.org/italia/controlled-vocabulary/public-event-types/514
notation: 5.1
narrower: https://w3id.org/italia/controlled-vocabulary/public-event-types/516
narrower: https://w3id.org/italia/controlled-vocabulary/public-event-types/515
in scheme: public-event-types
broader: https://w3id.org/italia/controlled-vocabulary/public-event-types/5
preferred label: Sport show @en
narrower: https://w3id.org/italia/controlled-vocabulary/public-event-types/511
type: PublicEventTypology
definition: Questo concetto include tutti gli eventi pubblici sportivi sia con che senza competizione
alternative label: Sport shows @en
has rank order: 2
narrower: https://w3id.org/italia/controlled-vocabulary/public-event-types/512
definition: This concept includes all public sport events (both with and without any competition) @en
narrower: https://w3id.org/italia/controlled-vocabulary/public-event-types/513