etichetta classificazione stelle strutture ricettive
type: Property
type: DatatypeProperty
comment: Questa proprietà rappresenta la label principale dell'elemento della classificazione delle stelle delle strutture ricettive. E' equivalente a skos:prefLabel dell'ontologia skos.
comment: This property represents the preferred label of the elements of the accommodation star rating classification. It is equivalent to skos:prefLabel. @en
domain: AccommodationStarRating
label: accommodation star rating preferred label @en
range: Literal
sub property of: name
version info: stabile
version info: stable @en
controlled vocabulary: accommodation-star-rating