valore generico
type: FunctionalProperty
type: DatatypeProperty
domain: OfferedServiceDescription
version info: stabile
version info: stable @en
comment: This property represents a generic value (literal). In the modelled domain of the accommodation facilities it is associated with the description of the offered services. @en
comment: Questa proprietà rappresenta un valore generico. Nel dominio modellato delle strutture ricettive essa è associata alla descrizione dei serivizi offerti
label: generic value @en
range: Literal