valore generico
type: FunctionalProperty
domain: OfferedServiceDescription
version info: stabile
comment: This property represents a generic value (literal). In the modelled domain of the accommodation facilities it is associated with the description of the offered services. @en
version info: stable @en
label: generic value @en
comment: Questa proprietà rappresenta un valore generico. Nel dominio modellato delle strutture ricettive essa è associata alla descrizione dei serivizi offerti
type: DatatypeProperty
range: Literal