è camera della struttura ricettiva
type: ObjectProperty
label: is accommodation room of @en
range: Accommodation
version info: stabile
version info: stable @en
comment: Inverse property of "has room" that links an accommodation room to its facility @en
comment: Proprietà inversa di "ha camera" che collega una camera (sala) alla propria struttura ricettiva.
domain: AccommodationRoom