is accommodation room of
type: ObjectProperty
comment: Inverse property of "has room" that links an accommodation room to its facility
comment: Proprietà inversa di "ha camera" che collega una camera (sala) alla propria struttura ricettiva. @it
domain: AccommodationRoom
label: è camera della struttura ricettiva @it
range: Accommodation
version info: stabile @it
version info: stable