total value
type: DatatypeProperty
comment: This property represents a total value (integer). In the modelled domain it is associated with the description of the offered services.
comment: Questa proprietà rappresenta un valore totale (intero). Nel dominio modellato delle strutture ricettive essa è associata alal descrizione dei servizi offerti @it
domain: OfferedServiceDescription
label: valore totale @it
range: int
version info: stable
version info: stabile @it