attesta nascita
type: ObjectProperty
type: FunctionalProperty
comment: Relazione tra l’atto amministrativo e iscrizione anagrafica per l’evento nascita.
domain: BirthCertificate
label: attests birth @en
range: RegistryEntryForBirth
sub property of: certifies