certificato per richiesta
type: ObjectProperty
comment: Relazione tra certificato e richiesta di certificato.
range: CertificateApplication
domain: Certificate
label: certificate issued for application @en
type: FunctionalProperty
type: InverseFunctionalProperty