data di iscrizione anagrafica per nascita
type: DatatypeProperty
type: FunctionalProperty
comment: Data dell'iscrizione in anagrafe di una persona per nascita.
domain: RegistryEntryForBirth
label: dateo of registry entry for birth @en
range: dateTime