depositato presso
type: ObjectProperty
comment: Relazione tra atto amministrativo e amministrazione pubblica.
range: PublicAdministration
domain: AdministrativeDeed
label: deposited in @en
type: FunctionalProperty