fa riferimento ad atto di nascita
type: ObjectProperty
type: FunctionalProperty
comment: Relazione tra atto di nascita e iscrizione anagrafica per nascita.
domain: RegistryEntryForBirth
label: references birth deed @en
range: BirthDeed
sub property of: attests