Representation
type: Class
comment: A representation of a semantic asset (e.g. a UML diagram).
comment: Una rappresentazione di un asset semantico (ad esempio un diagramma UML). @it
label: Rappresentazione @it
subclass of: Restriction
  on property: depicts
  some values from: SemanticAsset
was influenced by: http://xmlns.com/foaf/0.1/Image