Semantic Term
type: NamedIndividual
comment: An abstract entity that reflects the intellectual content of the semantic asset components (classes, properties, individuals, concepts).
subclass of: Restriction
  all values from: Semantic Term
  on property: related
comment: Entità astratta che fa riferimento sia alle classi di un asset semantico, che alle sue proprietà e ai suoi individui nonché ai concetti presenti in vocabolari controllati espressi usando linguaggi formali. @it
label: Termine semantico @it
subclass of: Concept
type: Class
subclass of: Restriction
  all values from: SemanticAsset
  on property: definedIn