contains
type: ObjectProperty
comment: Link between the asset repository and the semantic assets registered in it.
comment: Collegamento tra il registro degli asset e gli asset semantici registrati al suo interno. @it
range: SemanticAsset
domain: SemanticAssetRepository
label: contiene @it
inverse of: isContainedIn