è definito in
type: ObjectProperty
comment: Collegamento tra un termine semantico e l'asset semantico che lo definisce.
comment: Link between a semantic term and the semantic asset that defines it. @en
range: SemanticAsset
domain: SemanticTerm
label: defined in @en
inverse of: defines