ha collaboratore
type: AnnotationProperty
type: ObjectProperty
range: Agent
label: has contributor @en
comment: Link between a semantic asset and the responsible for making contributions to the asset. @en
comment: Collegamento tra l'asset semantico e l'agente responsabile per aver dato un contributo alla risorsa.
domain: SemanticAsset
inverse of: isContributorIn