has contributor
type: AnnotationProperty
type: ObjectProperty
comment: Link between a semantic asset and the responsible for making contributions to the asset.
comment: Collegamento tra l'asset semantico e l'agente responsabile per aver dato un contributo alla risorsa. @it
domain: SemanticAsset
label: ha collaboratore @it
range: Agent
inverse of: isContributorIn