has formality level
type: ObjectProperty
type: AnnotationProperty
domain: SemanticAsset
comment: Link between semantic asset and its level of formality.
comment: Collegamento tra l'asset semantico e il suo livello di formalità. @it
inverse of: isFormalityLevelOf
label: ha livello di formalità @it
range: FormalityLevel