has formality level
type: ObjectProperty
domain: SemanticAsset
comment: Link between semantic asset and its level of formality.
inverse of: isFormalityLevelOf
comment: Collegamento tra l'asset semantico e il suo livello di formalità. @it
type: AnnotationProperty
label: ha livello di formalità @it
range: FormalityLevel