has key class
type: ObjectProperty
type: AnnotationProperty
comment: Representative classes in the semantic asset.
comment: Classe rappresentativa nell'asset semantico.
range: Thing
domain: SemanticAsset
label: ha classe chiave @it