has task
type: AnnotationProperty
comment: Link between a Semantic Asset and its task.
domain: SemanticAsset
comment: Collegamento tra un asset semantico e il suo scenario di applicazione. @it
label: ha scenario di applicazione @it
inverse of: isSemanticTaskOF
range: OntologyTask
type: ObjectProperty