è contenuto in
type: ObjectProperty
comment: Collegamneto tra l'assert semantico e il registro degli asset semantici che lo contiene.
comment: Link between the semantic asset and the asset repository that contains it.
range: SemanticAssetRepository
domain: SemanticAsset
label: is contained in @en