è linguaggio di
type: ObjectProperty
comment: Collegamento tra il linguaggio con cui l'asset è implementato e l'asset semantico.
comment: Link between the language in which the asset is implemented and the semantic asset. @en
range: SemanticAsset
domain: OntologyLanguage
label: is ontology language of @en