is distribution of
type: ObjectProperty
comment: Link between Senantic Asset and its distribution.
comment: Collegamento tra l'Asset Semantico e la sua distribuzione. @it
range: SemanticAsset
domain: SemanticAssetDistribution
label: è distribuzione di @it