è scenario di applicazione di
type: ObjectProperty
comment: Collegamento tra lo scenario di applicazione e l'asset semantico.
comment: Link between a asset task and a semantic asset.
range: SemanticAsset
domain: OntologyTask
label: is semantic task of @en