ha ultima versione
type: ObjectProperty
type: AnnotationProperty
comment: A link to the current or latest version of the Semantic Asset.
comment: Collegamento alla corrente o ultima versione di un asset semantico.
range: SemanticAsset
domain: SemanticAsset
label: last @en