related
type: ObjectProperty
comment: Link between two semantic terms.
comment: Collegamento tra due termini semantici. @it
range: SemanticTerm
domain: SemanticTerm
label: collegato @it
type: SymmetricProperty