stato
type: DatatypeProperty
type: AnnotationProperty
comment: Stato della pubblicazione di una risorsa.
comment: Publication status of a resource. @en
domain: SemanticAsset
label: status @en
range: Datatype
  one of: archived
  one of: catalogued