supported schema
type: ObjectProperty
comment: Link between the Semantic Asset Repository and ontology used to implement it, e.g. ADMS.
comment: Collegamento tra il registro degli asset semantici e le ontologie usate per svilupparlo, per esempio ADMS. @it
range: SemanticAsset
domain: SemanticAssetRepository
label: ha come schema supportato @it
inverse of: supports