supporta
type: ObjectProperty
comment: Collegamento tra le ontologie usate per sviluppare il registro (per esempio ADMS) e il registro degli asset semantici.
comment: Link between the ontology used to implement the repository (e.g. ADMS) and the Semantic Asset Repository. @en
range: SemanticAssetRepository
domain: SemanticAsset
label: supports @en